Target
D(2) dopamine receptor
Ligand
BDBM50258433
Substrate
Meas. Tech.
ChEBML_1690523
Ki
0.300000±n/a nM
Citation
 Bucki, AMarcinkowska, M?niecikowska, JWi?ckowski, KPaw?owski, MG?uch-Lutwin, MGrybo?, ASiwek, APytka, KJastrz?bska-Wi?sek, MPartyka, AWeso?owska, AMierzejewski, PKo?aczkowski, M Novel 3-(1,2,3,6-Tetrahydropyridin-4-yl)-1H-indole-Based Multifunctional Ligands with Antipsychotic-Like, Mood-Modulating, and Procognitive Activity. J Med Chem 60:7483-7501 (2017)  
Target
Name:
D(2) dopamine receptor
Synonyms:
D(2) dopamine receptor DOPAMINE D2 Long DRD2 Dopamine D2 receptor Dopamine D2 receptor (D2R) Dopamine2-like | d2
Type:
Cell-surface receptors
Mol. Mass.:
50647.10
Organism:
Homo sapiens (Human)
Description:
P14416
Residue:
443
  
Inhibitor
Name:
BDBM50258433
Synonyms:
CHEMBL4062817
Type:
Small organic molecule
Emp. Form.:
C27H28FN3O2S
Mol. Mass.:
477.594
SMILES:
Fc1ccc2[nH]cc(C3=CCN(CCCCNS(=O)(=O)c4ccc5ccccc5c4)CC3)c2c1
: