Target
Polyunsaturated fatty acid 5-lipoxygenase
Ligand
BDBM50008940
Substrate
Meas. Tech.
ChEBML_736
IC50
1000±n/a nM
Citation
 Flynn, DLBelliotti, TRBoctor, AMConnor, DTKostlan, CRNies, DEOrtwine, DFSchrier, DJSircar, JC Styrylpyrazoles, styrylisoxazoles, and styrylisothiazoles. Novel 5-lipoxygenase and cyclooxygenase inhibitors. J Med Chem 34:518-25 (1991)  
Target
Name:
Polyunsaturated fatty acid 5-lipoxygenase
Synonyms:
Alox5 LOX5_RAT
Type:
PROTEIN
Mol. Mass.:
78082.31
Organism:
Rattus norvegicus
Description:
ChEMBL_1432947
Residue:
673
  
Inhibitor
Name:
BDBM50008940
Synonyms:
2,6-Diisopropyl-4-[2-(3-methyl-isoxazol-5-yl)-vinyl]-phenol | CHEMBL151433
Type:
Small organic molecule
Emp. Form.:
C18H23NO2
Mol. Mass.:
285.3807
SMILES:
CC(C)c1cc(\C=C\c2cc(C)no2)cc(C(C)C)c1O
: