Target
Lysine-specific histone demethylase 1A
Ligand
BDBM50142238
Substrate
Meas. Tech.
ChEMBL_1691602 (CHEMBL4042251)
Ki
29±n/a nM
Citation
 Wang, SZhao, LJZheng, YCShen, DDMiao, EFQiao, XPZhao, LJLiu, YHuang, RYu, BLiu, HM Design, synthesis and biological evaluation of [1,2,4]triazolo[1,5-a]pyrimidines as potent lysine specific demethylase 1 (LSD1/KDM1A) inhibitors. Eur J Med Chem 125:940-951 (2017)  
Target
Name:
Lysine-specific histone demethylase 1A
Synonyms:
AOF2 Flavin-containing amine oxidase domain-containing protein 2 KDM1A KIAA0601 Lysine-specific demethylase 1 (LSD1) Lysine-specific histone demethylase 1 (LSD1)
Type:
Enzyme
Mol. Mass.:
92901.01
Organism:
Homo sapiens (Human)
Description:
O60341
Residue:
852
  
Inhibitor
Name:
BDBM50142238
Synonyms:
CHEMBL3759201
Type:
Small organic molecule
Emp. Form.:
C25H25N3O
Mol. Mass.:
383.4855
SMILES:
Cc1ccc(cc1)-c1ncc(OCC2CCNCC2)cc1-c1ccc(cc1)C#N
: