Target
Histone deacetylase 8
Ligand
BDBM50005711
Substrate
Meas. Tech.
ChEBML_1691855
IC50
314±n/a nM
Citation
 Lee, HYLee, JFKumar, SWu, YWHuangFu, WCLai, MJLi, YHHuang, HLKuo, FCHsiao, CJCheng, CCYang, CRLiou, JP 3-Aroylindoles display antitumor activity in vitro and in vivo: Effects of N1-substituents on biological activity. Eur J Med Chem 125:1268-1278 (2017)  
Target
Name:
Histone deacetylase 8
Synonyms:
HD8 HDAC8_HUMAN Histone deacetylase 8 (HDAC-8) | Human HDAC8
Type:
Enzyme
Mol. Mass.:
41749.60
Organism:
Homo sapiens (Human)
Description:
Q9BY41
Residue:
377
  
Inhibitor
Name:
BDBM50005711
Synonyms:
CHEBI:46024 TRICHOSTATIN Trichostatin A (TSA) US10722597, Compound Trichostatin US20230322747, Compound trichostatin A | US9265734, TSA
Type:
Small organic molecule
Emp. Form.:
C17H22N2O3
Mol. Mass.:
302.3682
SMILES:
C[C@H](\C=C(/C)\C=C\C(=O)NO)C(=O)c1ccc(cc1)N(C)C
: