Target
G-protein coupled receptor 35
Ligand
BDBM50259854
Substrate
Meas. Tech.
ChEMBL_1691964 (CHEMBL4042613)
EC50
1410±n/a nM
Citation
 Wei, LWang, JZhang, XWang, PZhao, YLi, JHou, TQu, LShi, LLiang, XFang, Y Discovery of 2H-Chromen-2-one Derivatives as G Protein-Coupled Receptor-35 Agonists. J Med Chem 60:362-372 (2017)  
Target
Name:
G-protein coupled receptor 35
Synonyms:
G protein-coupled receptor 35 GPR35_HUMAN
Type:
Enzyme Catalytic Domain
Mol. Mass.:
34085.57
Organism:
Homo sapiens (Human)
Description:
gi_33695097
Residue:
309
  
Inhibitor
Name:
BDBM50259854
Synonyms:
CHEMBL4103143
Type:
Small organic molecule
Emp. Form.:
C11H6Br2N4O3
Mol. Mass.:
401.998
SMILES:
COc1c(Br)cc2cc(-c3nnn[nH]3)c(=O)oc2c1Br
: