Target
Carnitine O-palmitoyltransferase 1, muscle isoform
Ligand
BDBM50260109
Substrate
Meas. Tech.
ChEBML_1692709
IC50
19000±n/a nM
Citation
 Tseng, CCNoordali, HSani, MMadhani, MGrant, DMFrenneaux, MPZanda, MGreig, IR Development of Fluorinated Analogues of Perhexiline with Improved Pharmacokinetic Properties and Retained Efficacy. J Med Chem 60:2780-2789 (2017)  
Target
Name:
Carnitine O-palmitoyltransferase 1, muscle isoform
Synonyms:
CPT1B_RAT Cpt1b
Type:
PROTEIN
Mol. Mass.:
88241.28
Organism:
Rattus norvegicus
Description:
ChEMBL_887447
Residue:
772
  
Inhibitor
Name:
BDBM50260109
Synonyms:
CHEMBL4077250
Type:
Small organic molecule
Emp. Form.:
C17H31N
Mol. Mass.:
249.4347
SMILES:
C(C(C1CCCC1)C1CCCC1)C1CCCCN1
: