Target
Carnitine O-palmitoyltransferase 1, muscle isoform
Ligand
BDBM50260111
Substrate
Meas. Tech.
ChEBML_1692709
IC50
1200±n/a nM
Citation
 Tseng, CCNoordali, HSani, MMadhani, MGrant, DMFrenneaux, MPZanda, MGreig, IR Development of Fluorinated Analogues of Perhexiline with Improved Pharmacokinetic Properties and Retained Efficacy. J Med Chem 60:2780-2789 (2017)  
Target
Name:
Carnitine O-palmitoyltransferase 1, muscle isoform
Synonyms:
CPT1B_RAT Cpt1b
Type:
PROTEIN
Mol. Mass.:
88241.28
Organism:
Rattus norvegicus
Description:
ChEMBL_887447
Residue:
772
  
Inhibitor
Name:
BDBM50260111
Synonyms:
CHEBI:15531 | MALONYL-COENZYME A
Type:
Small organic molecule
Emp. Form.:
C24H38N7O19P3S
Mol. Mass.:
853.58
SMILES:
CC(C)(CO[P@](O)(=O)O[P@](O)(=O)OC[C@H]1O[C@H]([C@H](O)[C@@H]1OP(O)(O)=O)n1cnc2c(N)ncnc12)[C@@H](O)C(=O)NCCC(=O)NCCSC(=O)CC(O)=O
: