Target
G protein-coupled receptor kinase 5
Ligand
BDBM50260137
Substrate
Meas. Tech.
ChEBML_1692746
IC50
>100000±n/a nM
Citation
 Waldschmidt, HVHoman, KTCato, MCCruz-Rodríguez, OCannavo, AWilson, MWSong, JCheung, JYKoch, WJTesmer, JJLarsen, SD Structure-Based Design of Highly Selective and Potent G Protein-Coupled Receptor Kinase 2 Inhibitors Based on Paroxetine. J Med Chem 60:3052-3069 (2017)  
Target
Name:
G protein-coupled receptor kinase 5
Synonyms:
G protein-coupled receptor kinase 5 GPRK5 GRK5_BOVIN
Type:
PROTEIN
Mol. Mass.:
67903.06
Organism:
Bos taurus
Description:
ChEMBL_116955
Residue:
590
  
Inhibitor
Name:
BDBM50260137
Synonyms:
CHEMBL4062790
Type:
Small organic molecule
Emp. Form.:
C27H28FN3O4
Mol. Mass.:
477.5273
SMILES:
Fc1ccc(cc1CC(=O)NCc1ccccn1)[C@@H]1CCNC[C@H]1COc1ccc2OCOc2c1
: