Target
Serine/threonine-protein kinase pim-1
Ligand
BDBM50357598
Substrate
Meas. Tech.
ChEBML_1694026
IC50
2.0±n/a nM
Citation
 Swellmeen, LShahin, RAl-Hiari, YAlamiri, AHasan, AShaheen, O Structure based drug design of Pim-1 kinase followed by pharmacophore guided synthesis of quinolone-based inhibitors. Bioorg Med Chem 25:4855-4875 (2017)  
Target
Name:
Serine/threonine-protein kinase pim-1
Synonyms:
PIM-1 Kinase PIM1_HUMAN Serine/threonine-protein kinase (PIM1) Serine/threonine-protein kinase PIM1 | Serine/threonine-protein kinase pim-1 (PIM1)
Type:
Protein
Mol. Mass.:
35681.82
Organism:
Homo sapiens (Human)
Description:
P11309
Residue:
313
  
Inhibitor
Name:
BDBM50357598
Synonyms:
CHEMBL1915449
Type:
Small organic molecule
Emp. Form.:
C25H23ClN8
Mol. Mass.:
470.957
SMILES:
CN1CCN(CC1)c1ccc(Nc2nc3c(cccc3c3cnccc23)-c2nnc[nH]2)c(Cl)c1
: