Target
Tyrosine-protein kinase JAK2
Ligand
BDBM50261271
Substrate
Meas. Tech.
ChEMBL_1695700 (CHEMBL4046590)
Ki
10±n/a nM
Citation
 Liang, JVan Abbema, ABalazs, MBarrett, KBerezhkovsky, LBlair, WSChang, CDelarosa, DDeVoss, JDriscoll, JEigenbrot, CGoodacre, SGhilardi, NMacLeod, CJohnson, ABir Kohli, PLai, YLin, ZMantik, PMenghrajani, KNguyen, HPeng, ISambrone, AShia, SSmith, JSohn, STsui, VUltsch, MWilliams, KWu, LCYang, WZhang, BMagnuson, S Identification of an imidazopyridine scaffold to generate potent and selective TYK2 inhibitors that demonstrate activity in an in vivo psoriasis model. Bioorg Med Chem Lett 27:4370-4376 (2017)  
Target
Name:
Tyrosine-protein kinase JAK2
Synonyms:
JAK-2 JAK2_HUMAN Janus kinase 2 (JAK2) | Janus kinase 2 (a protein tyrosine kinase)
Type:
Protein
Mol. Mass.:
130684.68
Organism:
Homo sapiens (Human)
Description:
O60674
Residue:
1132
  
Inhibitor
Name:
BDBM50261271
Synonyms:
CHEMBL4080904
Type:
Small organic molecule
Emp. Form.:
C22H22Cl2N8O
Mol. Mass.:
485.369
SMILES:
OCCN1CCN(CC1)c1cc(Nc2nccc3nc([nH]c23)-c2c(Cl)cccc2Cl)ncn1
: