Target
Cyclin-dependent kinase 9
Ligand
BDBM50261273
Substrate
Meas. Tech.
ChEBML_1695713
Ki
108±n/a nM
Citation
 Liang, JVan Abbema, ABalazs, MBarrett, KBerezhkovsky, LBlair, WSChang, CDelarosa, DDeVoss, JDriscoll, JEigenbrot, CGoodacre, SGhilardi, NMacLeod, CJohnson, ABir Kohli, PLai, YLin, ZMantik, PMenghrajani, KNguyen, HPeng, ISambrone, AShia, SSmith, JSohn, STsui, VUltsch, MWilliams, KWu, LCYang, WZhang, BMagnuson, S Identification of an imidazopyridine scaffold to generate potent and selective TYK2 inhibitors that demonstrate activity in an in vivo psoriasis model. Bioorg Med Chem Lett 27:4370-4376 (2017)  
Target
Name:
Cyclin-dependent kinase 9
Synonyms:
C-2K CDK9 Cell division cycle 2-like protein kinase 4 Cyclin-Dependent Kinase 9 (CDK9) Serine/threonine-protein kinase PITALRE Tat-associated kinase complex catalytic subunit
Type:
Enzyme Subunit
Mol. Mass.:
42789.13
Organism:
Homo sapiens (Human)
Description:
Residue:
372
  
Inhibitor
Name:
BDBM50261273
Synonyms:
CHEMBL4076947
Type:
Small organic molecule
Emp. Form.:
C18H11Cl2N7
Mol. Mass.:
396.233
SMILES:
Cc1cc(Nc2nccc3nc([nH]c23)-c2c(Cl)cc(cc2Cl)C#N)ncn1
: