Target
Delta-type opioid receptor
Ligand
BDBM50264566
Substrate
Meas. Tech.
ChEMBL_1698855 (CHEMBL4049837)
Ki
429±n/a nM
Citation
 Wang, JSong, QXu, ABao, YXu, YZhu, Q Design, synthesis and biological evaluation of aminobenzyloxyarylamide derivatives as selective? opioid receptor antagonists. Eur J Med Chem 130:15-25 (2017)  
Target
Name:
Delta-type opioid receptor
Synonyms:
D-OR-1 Delta opioid receptor OPIATE Delta OPRD1 OPRK1 | opioid receptor, delta 1
Type:
G Protein-Coupled Receptor (GPCR)
Mol. Mass.:
40382.98
Organism:
Homo sapiens (Human)
Description:
Competition binding assays were carried out using membrane preparations from transfected HN9.10 cells that constitutively expressed the delta opioid receptor.
Residue:
372
  
Inhibitor
Name:
BDBM50264566
Synonyms:
CHEMBL4062024
Type:
Small organic molecule
Emp. Form.:
C26H26F2N2O2
Mol. Mass.:
436.4936
SMILES:
Cc1cc(C)cc(c1)C1CCCN1Cc1ccc(Oc2ccc(cc2F)C(N)=O)c(F)c1
: