Target
Induced myeloid leukemia cell differentiation protein Mcl-1
Ligand
BDBM50336576
Substrate
Meas. Tech.
ChEMBL_1701613 (CHEMBL4052846)
Kd
58±n/a nM
Citation
 Yap, JLChen, LLanning, MEFletcher, S Expanding the Cancer Arsenal with Targeted Therapies: Disarmament of the Antiapoptotic Bcl-2 Proteins by Small Molecules. J Med Chem 60:821-838 (2017)  
Target
Name:
Induced myeloid leukemia cell differentiation protein Mcl-1
Synonyms:
BCL2L3 Bcl-2-like protein 3 (Mcl-1) Bcl2-L-3 MCL1 Mcl-1 Myeloid cell leukemia sequence 1 (BCL2-related) | mcl1/EAT
Type:
Membrane; Single-pass membrane protein
Mol. Mass.:
37332.87
Organism:
Homo sapiens (Human)
Description:
Q07820
Residue:
350
  
Inhibitor
Name:
BDBM50336576
Synonyms:
3-Thiomorpholin-8-oxo-8H-acenaphtho[1,2-b]pyrrole-9-carbonitrile CHEMBL595134
Type:
Small organic molecule
Emp. Form.:
C19H13N3OS
Mol. Mass.:
331.391
SMILES:
O=c1nc2c3cccc4c(ccc(c2c1C#N)c34)N1CCSCC1
: