Target
Cathepsin G
Ligand
BDBM50266999
Substrate
Meas. Tech.
ChEMBL_1701757 (CHEMBL4052990)
Ki
3.4±n/a nM
Citation
 Swedberg, JELi, CYde Veer, SJWang, CKCraik, DJ Design of Potent and Selective Cathepsin G Inhibitors Based on the Sunflower Trypsin Inhibitor-1 Scaffold. J Med Chem 60:658-667 (2017)  
Target
Name:
Cathepsin G
Synonyms:
CATG_HUMAN CTSG
Type:
PROTEIN
Mol. Mass.:
28860.08
Organism:
Homo sapiens (Human)
Description:
ChEMBL_1469016
Residue:
255
  
Inhibitor
Name:
BDBM50266999
Synonyms:
CHEMBL4069983
Type:
Small organic molecule
Emp. Form.:
C72H104N14O17S2
Mol. Mass.:
1501.81
SMILES:
CCCCC1NC(=O)[C@@H]2CSSC[C@H](NC(=O)[C@@H](NC(=O)[C@@H]3CCCN3C(=O)[C@@H]3CCCN3C(=O)[C@@H](NC(=O)[C@H](CO)NC(=O)[C@H](Cc3ccccc3)NC1=O)[C@@H](C)CC)[C@@H](C)CC)C(=O)N[C@@H](Cc1ccccc1)C(=O)N1CCC[C@H]1C(=O)N[C@@H](CC(O)=O)C(=O)NCC(=O)N[C@@H]([C@@H](C)CC)C(=O)N2
: