Target
STE20/SPS1-related proline-alanine-rich protein kinase
Ligand
BDBM50267894
Substrate
Meas. Tech.
ChEMBL_1704121 (CHEMBL4055354)
IC50
>100000±n/a nM
Citation
 Ishigami-Yuasa, MWatanabe, YMori, TMasuno, HFujii, SKikuchi, EUchida, SKagechika, H Development of WNK signaling inhibitors as a new class of antihypertensive drugs. Bioorg Med Chem 25:3845-3852 (2017)  
Target
Name:
STE20/SPS1-related proline-alanine-rich protein kinase
Synonyms:
2.7.11.1 PSTK1 Pask STK39_RAT Spak Stk39
Type:
PROTEIN
Mol. Mass.:
60047.97
Organism:
Rattus norvegicus
Description:
ChEMBL_117413
Residue:
553
  
Inhibitor
Name:
BDBM50267894
Synonyms:
CHEMBL4102505
Type:
Small organic molecule
Emp. Form.:
C24H17F6N3O2
Mol. Mass.:
493.4011
SMILES:
CCOc1ccc2nc3cc(NC(=O)c4cc(cc(c4)C(F)(F)F)C(F)(F)F)ccc3c(N)c2c1
: