Target
Acetylcholinesterase
Ligand
BDBM50267968
Substrate
Meas. Tech.
ChEMBL_1704260 (CHEMBL4055493)
IC50
97300±n/a nM
Citation
 Seong, SHAli, MYKim, HRJung, HAChoi, JS BACE1 inhibitory activity and molecular docking analysis of meroterpenoids from Sargassum serratifolium. Bioorg Med Chem 25:3964-3970 (2017)  
Target
Name:
Acetylcholinesterase
Synonyms:
ACES_ELEEL Acetylcholinesterase (EeAChE) | ache
Type:
Enzyme
Mol. Mass.:
71812.79
Organism:
Electrophorus electricus (Electric eel)
Description:
Residue:
633
  
Inhibitor
Name:
BDBM50267968
Synonyms:
CHEMBL4085945
Type:
Small organic molecule
Emp. Form.:
C27H36O4
Mol. Mass.:
424.5723
SMILES:
[#6]\[#6](-[#6])=[#6]/[#6]-[#6]\[#6](=[#6]\[#6]-[#6]\[#6](-[#6])=[#6]\[#6]-[#6]C1([#6])[#8]-c2c(-[#6])cc(-[#8])cc2-[#6]=[#6]1)-[#6](-[#8])=O
: