Target
Beta-secretase 1
Ligand
BDBM50267969
Substrate
Meas. Tech.
ChEMBL_1704262 (CHEMBL4055495)
IC50
4400±n/a nM
Citation
 Seong, SHAli, MYKim, HRJung, HAChoi, JS BACE1 inhibitory activity and molecular docking analysis of meroterpenoids from Sargassum serratifolium. Bioorg Med Chem 25:3964-3970 (2017)  
Target
Name:
Beta-secretase 1
Synonyms:
ASP2 Aspartyl protease 2 BACE1 Beta-secretase (BACE) Beta-secretase 1 (BACE 1) Beta-secretase 1 (BACE1) Beta-site amyloid precursor protein cleaving enzyme 1 Memapsin-2 beta-Secretase (BACE-1) | beta-Secretase (BACE1)
Type:
Protein
Mol. Mass.:
55755.10
Organism:
Homo sapiens (Human)
Description:
P56817
Residue:
501
  
Inhibitor
Name:
BDBM50267969
Synonyms:
Sargahydroquinoic Acid
Type:
Small organic molecule
Emp. Form.:
C27H38O4
Mol. Mass.:
426.5882
SMILES:
[#6]\[#6](-[#6])=[#6]\[#6]-[#6]\[#6](=[#6]\[#6]-[#6]\[#6](-[#6])=[#6]\[#6]-[#6]\[#6](-[#6])=[#6]\[#6]-c1cc(-[#8])cc(-[#6])c1-[#8])-[#6](-[#8])=O
: