Target
Beta-secretase 1
Ligand
BDBM50267967
Substrate
Meas. Tech.
ChEMBL_1704263 (CHEMBL4055496)
Ki
4000±n/a nM
Citation
 Seong, SHAli, MYKim, HRJung, HAChoi, JS BACE1 inhibitory activity and molecular docking analysis of meroterpenoids from Sargassum serratifolium. Bioorg Med Chem 25:3964-3970 (2017)  
Target
Name:
Beta-secretase 1
Synonyms:
ASP2 Aspartyl protease 2 BACE1 Beta-secretase (BACE) Beta-secretase 1 (BACE 1) Beta-secretase 1 (BACE1) Beta-site amyloid precursor protein cleaving enzyme 1 Memapsin-2 beta-Secretase (BACE-1) | beta-Secretase (BACE1)
Type:
Protein
Mol. Mass.:
55755.10
Organism:
Homo sapiens (Human)
Description:
P56817
Residue:
501
  
Inhibitor
Name:
BDBM50267967
Synonyms:
CHEMBL4064412
Type:
Small organic molecule
Emp. Form.:
C27H36O4
Mol. Mass.:
424.5723
SMILES:
[#6]\[#6](-[#6])=[#6]\[#6]-[#6]\[#6](=[#6]\[#6]-[#6]\[#6](-[#6])=[#6]\[#6]-[#6]\[#6](-[#6])=[#6]\[#6]-[#6]-1=[#6]-[#6](=O)-[#6]=[#6](-[#6])-[#6]-1=O)-[#6](-[#8])=O
: