Target
Cholinesterase
Ligand
BDBM50267969
Substrate
Meas. Tech.
ChEMBL_1704261 (CHEMBL4055494)
IC50
15200±n/a nM
Citation
 Seong, SHAli, MYKim, HRJung, HAChoi, JS BACE1 inhibitory activity and molecular docking analysis of meroterpenoids from Sargassum serratifolium. Bioorg Med Chem 25:3964-3970 (2017)  
Target
Name:
Cholinesterase
Synonyms:
BCHE CHLE_HORSE | Cholinesterase
Type:
Enzyme
Mol. Mass.:
65643.35
Organism:
Equus caballus (Horse)
Description:
P81908
Residue:
574
  
Inhibitor
Name:
BDBM50267969
Synonyms:
Sargahydroquinoic Acid
Type:
Small organic molecule
Emp. Form.:
C27H38O4
Mol. Mass.:
426.5882
SMILES:
[#6]\[#6](-[#6])=[#6]\[#6]-[#6]\[#6](=[#6]\[#6]-[#6]\[#6](-[#6])=[#6]\[#6]-[#6]\[#6](-[#6])=[#6]\[#6]-c1cc(-[#8])cc(-[#6])c1-[#8])-[#6](-[#8])=O
: