Target
Sodium channel protein type 9 subunit alpha
Ligand
BDBM217696
Substrate
Meas. Tech.
ChEMBL_1705666 (CHEMBL4056899)
IC50
20±n/a nM
Citation
 Schenkel, LBDiMauro, EFNguyen, HNChakka, NDu, BFoti, RSGuzman-Perez, AJarosh, MLa, DSLigutti, JMilgram, BCMoyer, BDPeterson, EARoberts, JYu, VLWeiss, MM Discovery of a biarylamide series of potent, state-dependent Na Bioorg Med Chem Lett 27:3817-3824 (2017)  
Target
Name:
Sodium channel protein type 9 subunit alpha
Synonyms:
NENA Peripheral sodium channel 1 SCN9A_HUMAN Voltage-gated sodium channel subunit Nav1.7 hNE-Na
Type:
Protein
Mol. Mass.:
226375.97
Organism:
Homo sapiens (Human)
Description:
Q15858
Residue:
1988
  
Inhibitor
Name:
BDBM217696
Synonyms:
US9212182, 672
Type:
Small organic molecule
Emp. Form.:
C27H19F3N4O4S
Mol. Mass.:
552.524
SMILES:
COc1cc(ccc1-n1c2ccc(cc2ccc1=O)S(=O)(=O)Nc1ncccn1)-c1cccc(c1)C(F)(F)F
: