Target
Prostaglandin G/H synthase 1
Ligand
BDBM50269587
Substrate
Meas. Tech.
ChEMBL_1706755 (CHEMBL4057988)
IC50
40450±n/a nM
Citation
 Shen, FQWang, ZCWu, SYRen, SZMan, RJWang, BZZhu, HL Synthesis of novel hybrids of pyrazole and coumarin as dual inhibitors of COX-2 and 5-LOX. Bioorg Med Chem Lett 27:3653-3660 (2017)  
Target
Name:
Prostaglandin G/H synthase 1
Synonyms:
COX-1 Cyclooxygenase Cyclooxygenase-1 (COX-1) PTGS1 | Prostaglandin G/H synthase (cyclooxygenase)
Type:
Enzyme
Mol. Mass.:
68692.62
Organism:
Homo sapiens (Human)
Description:
P23219
Residue:
599
  
Inhibitor
Name:
BDBM50269587
Synonyms:
CHEMBL4070807
Type:
Small organic molecule
Emp. Form.:
C27H20FN3O7S
Mol. Mass.:
549.527
SMILES:
NS(=O)(=O)c1ccc(cc1)-n1nc(cc1-c1cccc(F)c1)C(=O)OCCOc1cc(=O)oc2ccccc12
: