Target
Polyunsaturated fatty acid 5-lipoxygenase
Ligand
BDBM50269587
Substrate
Meas. Tech.
ChEMBL_1706757 (CHEMBL4057990)
IC50
1380±n/a nM
Citation
 Shen, FQWang, ZCWu, SYRen, SZMan, RJWang, BZZhu, HL Synthesis of novel hybrids of pyrazole and coumarin as dual inhibitors of COX-2 and 5-LOX. Bioorg Med Chem Lett 27:3653-3660 (2017)  
Target
Name:
Polyunsaturated fatty acid 5-lipoxygenase
Synonyms:
Alox5 LOX5_RAT
Type:
PROTEIN
Mol. Mass.:
78082.31
Organism:
Rattus norvegicus
Description:
ChEMBL_1432947
Residue:
673
  
Inhibitor
Name:
BDBM50269587
Synonyms:
CHEMBL4070807
Type:
Small organic molecule
Emp. Form.:
C27H20FN3O7S
Mol. Mass.:
549.527
SMILES:
NS(=O)(=O)c1ccc(cc1)-n1nc(cc1-c1cccc(F)c1)C(=O)OCCOc1cc(=O)oc2ccccc12
: