Target
Prostaglandin G/H synthase 2
Ligand
BDBM50269587
Substrate
Meas. Tech.
ChEMBL_1706756 (CHEMBL4057989)
IC50
300±n/a nM
Citation
 Shen, FQWang, ZCWu, SYRen, SZMan, RJWang, BZZhu, HL Synthesis of novel hybrids of pyrazole and coumarin as dual inhibitors of COX-2 and 5-LOX. Bioorg Med Chem Lett 27:3653-3660 (2017)  
Target
Name:
Prostaglandin G/H synthase 2
Synonyms:
COX2 Cyclooxygenase 2 (COX-2) Cyclooxygenase-2 (COX-2 AA) Cyclooxygenase-2 (COX-2) PGH2_HUMAN PHS II Prostaglandin E synthase/G/H synthase 2 Prostaglandin-endoperoxide synthase 2
Type:
Enzyme
Mol. Mass.:
69003.89
Organism:
Homo sapiens (Human)
Description:
Recombinant Cox-2 provided by Cayman (Cayman Chemical Co.,Ann Arbor, MI).
Residue:
604
  
Inhibitor
Name:
BDBM50269587
Synonyms:
CHEMBL4070807
Type:
Small organic molecule
Emp. Form.:
C27H20FN3O7S
Mol. Mass.:
549.527
SMILES:
NS(=O)(=O)c1ccc(cc1)-n1nc(cc1-c1cccc(F)c1)C(=O)OCCOc1cc(=O)oc2ccccc12
: