Target
C-X-C chemokine receptor type 4
Ligand
BDBM50443541
Substrate
Meas. Tech.
ChEMBL_1707933 (CHEMBL4059166)
IC50
6.3±n/a nM
Citation
 Miller, EJJecs, ETruax, VMKatzman, BMTahirovic, YAWilson, RJKuo, KMKim, MBNguyen, HHSaindane, MTZhao, HWang, TSum, CSCvijic, MESchroeder, GMWilson, LJLiotta, DC Discovery of Tetrahydroisoquinoline-Containing CXCR4 Antagonists with Improved in Vitro ADMET Properties. J Med Chem 61:946-979 (2018)  
Target
Name:
C-X-C chemokine receptor type 4
Synonyms:
C-X-C chemokine receptor type 4 CD_antigen=CD184 CXCR-4 CXCR4_HUMAN Fusin LCR1 Leukocyte-derived seven transmembrane domain receptor SDF-1 receptor | Stromal cell-derived factor 1 receptor
Type:
Enzyme
Mol. Mass.:
39754.61
Organism:
Homo sapiens (Human)
Description:
P61073
Residue:
352
  
Inhibitor
Name:
BDBM50443541
Synonyms:
CHEMBL3091687
Type:
Small organic molecule
Emp. Form.:
C23H32N4
Mol. Mass.:
364.527
SMILES:
NCCCCN(C[C@H]1Cc2ccccc2CN1)[C@H]1CCCc2cccnc12
: