Target
Neuronal acetylcholine receptor subunit alpha-3/beta-4
Ligand
BDBM50006638
Substrate
Meas. Tech.
ChEMBL_1708053 (CHEMBL4059286)
Ki
300000±n/a nM
Citation
 Crestey, FJensen, AASoerensen, CMagnus, CBAndreasen, JTPeters, GHJKristensen, JL Dual Nicotinic Acetylcholine Receptor ?4?2 Antagonists/?7 Agonists: Synthesis, Docking Studies, and Pharmacological Evaluation of Tetrahydroisoquinolines and Tetrahydroisoquinolinium Salts. J Med Chem 61:1719-1729 (2018)  
Target
Name:
Neuronal acetylcholine receptor subunit alpha-3/beta-4
Synonyms:
Neuronal acetylcholine receptor Alpha-3/Beta-4 Neuronal acetylcholine receptor; alpha3/beta4 | nAChR subtypes alpha3 beta4
Type:
Protein
Mol. Mass.:
Description:
Components:
This complex has 2 components.
Component 1
Name:
Neuronal acetylcholine receptor subunit alpha-3
Synonyms:
ACHA3_RAT Chrna3
Type:
Enzyme
Mol. Mass.:
56995.52
Organism:
Rattus norvegicus (Rat)
Description:
P04757
Residue:
499
  
Component 2
Name:
Neuronal acetylcholine receptor subunit beta-4
Synonyms:
ACHB4_RAT Chrnb4 Neuronal acetylcholine receptor non-alpha-2 chain | Neuronal acetylcholine receptor protein beta-4 subunit
Type:
Enzyme
Mol. Mass.:
55863.89
Organism:
Rattus norvegicus (Rat)
Description:
P12392
Residue:
495
  
Inhibitor
Name:
BDBM50006638
Synonyms:
CHEMBL2140445
Type:
Small organic molecule
Emp. Form.:
C11H13NO2
Mol. Mass.:
191.2264
SMILES:
CN1CCc2cc3OCOc3cc2C1
: