Target
Protease
Ligand
BDBM50270586
Substrate
Meas. Tech.
ChEMBL_1709400 (CHEMBL4119449)
IC50
2.2±n/a nM
Citation
 Bai, XYang, ZZhu, MDong, BZhou, LZhang, GWang, JWang, Y Design and synthesis of potent HIV-1 protease inhibitors with (S)-tetrahydrofuran-tertiary amine-acetamide as P2-ligand: Structure-activity studies and biological evaluation. Eur J Med Chem 137:30-44 (2017)  
Target
Name:
Protease
Synonyms:
Type:
Enzyme
Mol. Mass.:
10904.79
Organism:
Human immunodeficiency virus 1 (HIV-1)
Description:
Q9YQ12
Residue:
99
  
Inhibitor
Name:
BDBM50270586
Synonyms:
CHEMBL4129203
Type:
Small organic molecule
Emp. Form.:
C27H39N3O6S
Mol. Mass.:
533.68
SMILES:
COc1ccc(cc1)S(=O)(=O)N(CC(C)C)C[C@@H](O)[C@H](Cc1ccccc1)NC(=O)CN[C@H]1CCOC1
: