Target
Toxopain-2
Ligand
BDBM50271687
Substrate
Meas. Tech.
ChEMBL_1711555 (CHEMBL4121604)
IC50
14000±n/a nM
Citation
 Zwicker, JDDiaz, NAGuerra, AJKirchhoff, PDWen, BSun, DCarruthers, VBLarsen, SD Optimization of dipeptidic inhibitors of cathepsin L for improved Toxoplasma gondii selectivity and CNS permeability. Bioorg Med Chem Lett 28:1972-1980 (2018)  
Target
Name:
Toxopain-2
Synonyms:
CPL Toxopain-2
Type:
PROTEIN
Mol. Mass.:
47549.50
Organism:
Toxoplasma gondii
Description:
ChEMBL_118107
Residue:
422
  
Inhibitor
Name:
BDBM50271687
Synonyms:
CHEMBL4128058
Type:
Small organic molecule
Emp. Form.:
C17H23FN4O2
Mol. Mass.:
334.3885
SMILES:
CN(C)CCCC[C@H](NC(=O)c1ccc(F)cc1)C(=O)NCC#N
: