Target
Metallo-beta-lactamase type 2
Ligand
BDBM50271846
Substrate
Meas. Tech.
ChEMBL_1711699 (CHEMBL4121748)
IC50
8200±n/a nM
Citation
 Zhang, DMarkoulides, MSStepanovs, DRydzik, AMEl-Hussein, ABon, CKamps, JJAGUmland, KDCollins, PMCahill, STWang, DYvon Delft, FBrem, JMcDonough, MASchofield, CJ Structure activity relationship studies on rhodanines and derived enethiol inhibitors of metallo-?-lactamases. Bioorg Med Chem 26:2928-2936 (2018)  
Target
Name:
Metallo-beta-lactamase type 2
Synonyms:
3.5.2.6 BLA2_BACCE Cephalosporinase Metallo-beta-lactamase type II Penicillinase blm
Type:
PROTEIN
Mol. Mass.:
28099.58
Organism:
Bacillus cereus
Description:
ChEMBL_117940
Residue:
257
  
Inhibitor
Name:
BDBM50271846
Synonyms:
CHEMBL3221930
Type:
Small organic molecule
Emp. Form.:
C9H7FO2S
Mol. Mass.:
198.214
SMILES:
OC(=O)C(\S)=C\c1ccc(F)cc1
: