Target
Metallo-beta-lactamase type 2
Ligand
BDBM50271891
Substrate
Meas. Tech.
ChEMBL_1711699 (CHEMBL4121748)
IC50
600±n/a nM
Citation
 Zhang, DMarkoulides, MSStepanovs, DRydzik, AMEl-Hussein, ABon, CKamps, JJAGUmland, KDCollins, PMCahill, STWang, DYvon Delft, FBrem, JMcDonough, MASchofield, CJ Structure activity relationship studies on rhodanines and derived enethiol inhibitors of metallo-?-lactamases. Bioorg Med Chem 26:2928-2936 (2018)  
Target
Name:
Metallo-beta-lactamase type 2
Synonyms:
3.5.2.6 BLA2_BACCE Cephalosporinase Metallo-beta-lactamase type II Penicillinase blm
Type:
PROTEIN
Mol. Mass.:
28099.58
Organism:
Bacillus cereus
Description:
ChEMBL_117940
Residue:
257
  
Inhibitor
Name:
BDBM50271891
Synonyms:
CHEMBL4129450
Type:
Small organic molecule
Emp. Form.:
C17H17Cl3N4O3S
Mol. Mass.:
463.766
SMILES:
CN1CCN(CC1)NC(=O)CN1C(=O)S\C(=C/c2c(Cl)ccc(Cl)c2Cl)C1=O
: