Target
Proteasome subunit beta type-8
Ligand
BDBM50274026
Substrate
Meas. Tech.
ChEMBL_1713676 (CHEMBL4123725)
IC50
14000±n/a nM
Citation
 Artschwager, RWard, DJGannon, SBrouwer, AJvan de Langemheen, HKowalski, HLiskamp, RMJ Potent and Highly Selective Inhibitors of the Proteasome Trypsin-like Site by Incorporation of Basic Side Chain Containing Amino Acid Derived Sulfonyl Fluorides. J Med Chem 61:5395-5411 (2018)  
Target
Name:
Proteasome subunit beta type-8
Synonyms:
26S proteosome Low molecular mass protein 7 Multicatalytic endopeptidase complex subunit C13 PSMB5i Proteasome component C13 Proteasome subunit beta-5i Y2
Type:
PROTEIN
Mol. Mass.:
30357.49
Organism:
Homo sapiens (Human)
Description:
ChEMBL_1446797
Residue:
276
  
Inhibitor
Name:
BDBM50274026
Synonyms:
CHEMBL4129220
Type:
Small organic molecule
Emp. Form.:
C32H54FN7O7S
Mol. Mass.:
699.877
SMILES:
CC(C)C[C@H](NC(=O)OCc1ccccc1)C(=O)N[C@@H](CC(C)C)C(=O)N[C@@H](CC(C)C)C(=O)N[C@@H](CCCNC(N)=N)CS(F)(=O)=O
: