Target
Adenosine receptor A1
Ligand
BDBM50014266
Substrate
Meas. Tech.
ChEBML_29008
Ki
8420±n/a nM
Citation
 Müller, CEHide, IDaly, JWRothenhäusler, KEger, K 7-Deaza-2-phenyladenines: structure-activity relationships of potent A1 selective adenosine receptor antagonists. J Med Chem 33:2822-8 (1990)  
Target
Name:
Adenosine receptor A1
Synonyms:
AA1R_RAT ADENOSINE A1 high Adenosine A1 receptor (A1) Adenosine receptors A1 | Adora1
Type:
Protein
Mol. Mass.:
36704.13
Organism:
Rattus norvegicus (rat)
Description:
Residue:
326
  
Inhibitor
Name:
BDBM50014266
Synonyms:
(9-Phenyl-9H-1,3,9-triaza-fluoren-4-yl)-hydrazine | CHEMBL317729
Type:
Small organic molecule
Emp. Form.:
C16H13N5
Mol. Mass.:
275.3079
SMILES:
NNc1ncnc2n(-c3ccccc3)c3ccccc3c12
: