Target
Adenosine receptor A1
Ligand
BDBM50014274
Substrate
Meas. Tech.
ChEBML_29008
Ki
36±n/a nM
Citation
 Müller, CEHide, IDaly, JWRothenhäusler, KEger, K 7-Deaza-2-phenyladenines: structure-activity relationships of potent A1 selective adenosine receptor antagonists. J Med Chem 33:2822-8 (1990)  
Target
Name:
Adenosine receptor A1
Synonyms:
AA1R_RAT ADENOSINE A1 high Adenosine A1 receptor (A1) Adenosine receptors A1 | Adora1
Type:
Protein
Mol. Mass.:
36704.13
Organism:
Rattus norvegicus (rat)
Description:
Residue:
326
  
Inhibitor
Name:
BDBM50014274
Synonyms:
5,6-Dimethyl-2,7-diphenyl-7H-pyrrolo[2,3-d]pyrimidin-4-ylamine | CHEMBL95101
Type:
Small organic molecule
Emp. Form.:
C20H18N4
Mol. Mass.:
314.3837
SMILES:
Cc1c(C)c2c(N)nc(nc2n1-c1ccccc1)-c1ccccc1
: