Target
Adenosine receptor A1
Ligand
BDBM50014276
Substrate
Meas. Tech.
ChEBML_29008
Ki
84800.0±n/a nM
Citation
 Müller, CEHide, IDaly, JWRothenhäusler, KEger, K 7-Deaza-2-phenyladenines: structure-activity relationships of potent A1 selective adenosine receptor antagonists. J Med Chem 33:2822-8 (1990)  
Target
Name:
Adenosine receptor A1
Synonyms:
AA1R_RAT ADENOSINE A1 high Adenosine A1 receptor (A1) Adenosine receptors A1 | Adora1
Type:
Protein
Mol. Mass.:
36704.13
Organism:
Rattus norvegicus (rat)
Description:
Residue:
326
  
Inhibitor
Name:
BDBM50014276
Synonyms:
9-Phenyl-6,7,8,9-tetrahydro-5H-1,3,9-triaza-fluorene-2,4-dithiol | CHEMBL316857
Type:
Small organic molecule
Emp. Form.:
C16H15N3S2
Mol. Mass.:
313.44
SMILES:
S=c1[nH]c2n(c3CCCCc3c2c(=S)[nH]1)-c1ccccc1
: