Target
Adenosine receptor A1
Ligand
BDBM50014286
Substrate
Meas. Tech.
ChEBML_29008
Ki
2070±n/a nM
Citation
 Müller, CEHide, IDaly, JWRothenhäusler, KEger, K 7-Deaza-2-phenyladenines: structure-activity relationships of potent A1 selective adenosine receptor antagonists. J Med Chem 33:2822-8 (1990)  
Target
Name:
Adenosine receptor A1
Synonyms:
AA1R_RAT ADENOSINE A1 high Adenosine A1 receptor (A1) Adenosine receptors A1 | Adora1
Type:
Protein
Mol. Mass.:
36704.13
Organism:
Rattus norvegicus (rat)
Description:
Residue:
326
  
Inhibitor
Name:
BDBM50014286
Synonyms:
9-Phenyl-6,7,8,9-tetrahydro-5H-1,3,9-triaza-fluoren-4-ol | CHEMBL97150
Type:
Small organic molecule
Emp. Form.:
C16H15N3O
Mol. Mass.:
265.3098
SMILES:
O=c1[nH]cnc2n(c3CCCCc3c12)-c1ccccc1
: