Target
Adenosine receptor A1
Ligand
BDBM50014290
Substrate
Meas. Tech.
ChEBML_29008
Ki
52.0±n/a nM
Citation
 Müller, CEHide, IDaly, JWRothenhäusler, KEger, K 7-Deaza-2-phenyladenines: structure-activity relationships of potent A1 selective adenosine receptor antagonists. J Med Chem 33:2822-8 (1990)  
Target
Name:
Adenosine receptor A1
Synonyms:
AA1R_RAT ADENOSINE A1 high Adenosine A1 receptor (A1) Adenosine receptors A1 | Adora1
Type:
Protein
Mol. Mass.:
36704.13
Organism:
Rattus norvegicus (rat)
Description:
Residue:
326
  
Inhibitor
Name:
BDBM50014290
Synonyms:
2-(2-Chloro-phenyl)-5,6-dimethyl-7-(1-phenyl-ethyl)-7H-pyrrolo[2,3-d]pyrimidin-4-ylamine | CHEMBL316716
Type:
Small organic molecule
Emp. Form.:
C22H21ClN4
Mol. Mass.:
376.882
SMILES:
CC(c1ccccc1)n1c(C)c(C)c2c(N)nc(nc12)-c1ccccc1Cl
: