Target
Adenosine receptor A2a/A2b
Ligand
BDBM50014285
Substrate
Meas. Tech.
ChEMBL_30693 (CHEMBL646321)
Ki
5980±n/a nM
Citation
 Müller, CEHide, IDaly, JWRothenhäusler, KEger, K 7-Deaza-2-phenyladenines: structure-activity relationships of potent A1 selective adenosine receptor antagonists. J Med Chem 33:2822-8 (1990)  
Target
Name:
Adenosine receptor A2a/A2b
Synonyms:
Adenosine A2 receptor
Type:
Mol. Mass.:
Description:
ASSAY_ID of ChEMBL is 30560
Components:
This complex has 2 components.
Component 1
Name:
Adenosine receptor A2b
Synonyms:
AA2BR_RAT Adora2b
Type:
PROTEIN
Mol. Mass.:
36378.84
Organism:
Rattus norvegicus
Description:
ChEMBL_32934
Residue:
332
  
Component 2
Name:
Adenosine receptor A2a
Synonyms:
AA2AR_RAT Adenosine A2 receptor Adenosine Receptors A2a (A2a) Adenosine receptors A2a Rat striatal adenosine A2a receptor
Type:
G Protein-Coupled Receptor (GPCR)
Mol. Mass.:
45015.65
Organism:
Rattus norvegicus (rat)
Description:
Rat A2A receptors expressed in CHO cells.
Residue:
410
  
Inhibitor
Name:
BDBM50014285
Synonyms:
9-Phenyl-9H-1,3,9-triaza-fluoren-4-ylamine | CHEMBL94871
Type:
Small organic molecule
Emp. Form.:
C16H12N4
Mol. Mass.:
260.2933
SMILES:
Nc1ncnc2n(-c3ccccc3)c3ccccc3c12
: