Target
Adenosine receptor A2a/A2b
Ligand
BDBM50014280
Substrate
Meas. Tech.
ChEMBL_30693 (CHEMBL646321)
Ki
80800±n/a nM
Citation
 Müller, CEHide, IDaly, JWRothenhäusler, KEger, K 7-Deaza-2-phenyladenines: structure-activity relationships of potent A1 selective adenosine receptor antagonists. J Med Chem 33:2822-8 (1990)  
Target
Name:
Adenosine receptor A2a/A2b
Synonyms:
Adenosine A2 receptor
Type:
Mol. Mass.:
Description:
ASSAY_ID of ChEMBL is 30560
Components:
This complex has 2 components.
Component 1
Name:
Adenosine receptor A2b
Synonyms:
AA2BR_RAT Adora2b
Type:
PROTEIN
Mol. Mass.:
36378.84
Organism:
Rattus norvegicus
Description:
ChEMBL_32934
Residue:
332
  
Component 2
Name:
Adenosine receptor A2a
Synonyms:
AA2AR_RAT Adenosine A2 receptor Adenosine Receptors A2a (A2a) Adenosine receptors A2a Rat striatal adenosine A2a receptor
Type:
G Protein-Coupled Receptor (GPCR)
Mol. Mass.:
45015.65
Organism:
Rattus norvegicus (rat)
Description:
Rat A2A receptors expressed in CHO cells.
Residue:
410
  
Inhibitor
Name:
BDBM50014280
Synonyms:
5,6-Dimethyl-2-phenyl-7-((S)-1-phenyl-ethyl)-7H-pyrrolo[2,3-d]pyrimidin-4-ylamine CHEMBL82289
Type:
Small organic molecule
Emp. Form.:
C22H22N4
Mol. Mass.:
342.4369
SMILES:
C[C@@H](c1ccccc1)n1c(C)c(C)c2c(N)nc(nc12)-c1ccccc1
: