Target
Steroid 17-alpha-hydroxylase/17,20 lyase
Ligand
BDBM50274160
Substrate
Meas. Tech.
ChEMBL_1713960 (CHEMBL4124009)
IC50
17±n/a nM
Citation
 Blass, BEIyer, PAbou-Gharbia, MChilders, WEGordon, JCRamanjulu, MMorton, GArumugam, PBoruwa, JEllingboe, JMitra, SReddy Nimmareddy, RPaliwal, SRajasekhar, JShivakumar, SSrivastava, PTangirala, RSVenkataramanaiah, KBobbala, RYanamandra, MKrishnakanth Reddy, L Design and synthesis of functionalized piperazin-1yl-(E)-stilbenes as inhibitors of 17?-hydroxylase-C17,20-lyase (Cyp17). Bioorg Med Chem Lett 28:2270-2274 (2018)  
Target
Name:
Steroid 17-alpha-hydroxylase/17,20 lyase
Synonyms:
CP17A_HUMAN CYP17A1 Cytochrome P450 17A1 Cytochrome P450 C17 (CYP17) Cytochrome P450-C17 P450-C17 Steroid 17-alpha-Monooxygenase (CYP17) Steroid 17-alpha-monooxygenase | cytochrome P450 monooxygenase 17 alpha hydroxylase/17,20-lyase (CYP17)
Type:
Enzyme
Mol. Mass.:
57382.42
Organism:
Homo sapiens (Human)
Description:
E.coli expressing human CYP17
Residue:
508
  
Inhibitor
Name:
BDBM50274160
Synonyms:
CHEMBL4128621
Type:
Small organic molecule
Emp. Form.:
C27H26ClN5O2S
Mol. Mass.:
520.046
SMILES:
Clc1cc(Cn2ccnc2)cc(\C=C\c2ccc(cc2)N2CCN(CC2)S(=O)(=O)c2cccnc2)c1
: