Target
Thymidylate synthase
Ligand
BDBM50014496
Substrate
Meas. Tech.
ChEBML_209803
IC50
36±n/a nM
Citation
 Jackman, ALMarsham, PRThornton, TJBishop, JAO'Connor, BMHughes, LRCalvert, AHJones, TR Quinazoline antifolate thymidylate synthase inhibitors: 2'-fluoro-N10-propargyl-5,8-dideazafolic acid and derivatives with modifications in the C2 position. J Med Chem 33:3067-71 (1990)  
Target
Name:
Thymidylate synthase
Synonyms:
TS TYSY_MOUSE | Tyms
Type:
PROTEIN
Mol. Mass.:
34957.15
Organism:
Mus musculus
Description:
ChEMBL_1340097
Residue:
307
  
Inhibitor
Name:
BDBM50014496
Synonyms:
(S)-2-(2-fluoro-4-(((2-methoxy-4-oxo-3,4-dihydroquinazolin-6-yl)methyl)(prop-2-ynyl)amino)benzamido)pentanedioic acid CHEMBL105026
Type:
Small organic molecule
Emp. Form.:
C25H23FN4O7
Mol. Mass.:
510.4711
SMILES:
COc1nc2ccc(CN(CC#C)c3ccc(C(=O)N[C@@H](CCC(O)=O)C(O)=O)c(F)c3)cc2c(=O)[nH]1
: