Target
Mu-type opioid receptor
Ligand
BDBM50009146
Substrate
Meas. Tech.
ChEMBL_1714220 (CHEMBL4124269)
EC50
16±n/a nM
Citation
 Willemse, TEiselt, EHollanders, KSchepens, Wvan Vlijmen, HWTChung, NNBlais, VHolleran, BLongpré, JMSchiller, PWMaes, BUWSarret, PGendron, LBallet, S Chemical space screening around Phe Bioorg Med Chem Lett 28:2320-2323 (2018)  
Target
Name:
Mu-type opioid receptor
Synonyms:
MOR-1 Mu-type opioid receptor (MOR) OPRM_RAT Opioid receptor B Ror-b
Type:
G Protein-Coupled Receptor (GPCR)
Mol. Mass.:
44503.11
Organism:
Rattus norvegicus (rat)
Description:
Competition binding assays were carried out using membrane preparations from transfected HN9.10 cells that constitutively expressed the mu opioid receptor.
Residue:
398
  
Inhibitor
Name:
BDBM50009146
Synonyms:
(S)-4-((S)-2-{(R)-2-[(S)-2-Amino-3-(4-hydroxy-phenyl)-propionylamino]-propionylamino}-3-phenyl-propionylamino)-4-{(S)-1-[(S)-1-(carboxymethyl-carbamoyl)-2-methyl-propylcarbamoyl]-2-methyl-propylcarbamoyl}-butyric acid CHEMBL26575
Type:
Small organic molecule
Emp. Form.:
C38H53N7O11
Mol. Mass.:
783.8677
SMILES:
CC(C)[C@H](NC(=O)[C@@H](NC(=O)[C@H](CCC(O)=O)NC(=O)[C@H](Cc1ccccc1)NC(=O)[C@@H](C)NC(=O)[C@@H](N)Cc1ccc(O)cc1)C(C)C)C(=O)NCC(O)=O
: