Target
Delta-type opioid receptor
Ligand
BDBM50009146
Substrate
Meas. Tech.
ChEMBL_1714216 (CHEMBL4124265)
IC50
1.000000±n/a nM
Citation
 Willemse, TEiselt, EHollanders, KSchepens, Wvan Vlijmen, HWTChung, NNBlais, VHolleran, BLongpré, JMSchiller, PWMaes, BUWSarret, PGendron, LBallet, S Chemical space screening around Phe Bioorg Med Chem Lett 28:2320-2323 (2018)  
Target
Name:
Delta-type opioid receptor
Synonyms:
DOR-1 MSL-2 OPRD_MOUSE Oprd1
Type:
Enzyme Catalytic Domain
Mol. Mass.:
40577.25
Organism:
MOUSE
Description:
P32300
Residue:
372
  
Inhibitor
Name:
BDBM50009146
Synonyms:
(S)-4-((S)-2-{(R)-2-[(S)-2-Amino-3-(4-hydroxy-phenyl)-propionylamino]-propionylamino}-3-phenyl-propionylamino)-4-{(S)-1-[(S)-1-(carboxymethyl-carbamoyl)-2-methyl-propylcarbamoyl]-2-methyl-propylcarbamoyl}-butyric acid CHEMBL26575
Type:
Small organic molecule
Emp. Form.:
C38H53N7O11
Mol. Mass.:
783.8677
SMILES:
CC(C)[C@H](NC(=O)[C@@H](NC(=O)[C@H](CCC(O)=O)NC(=O)[C@H](Cc1ccccc1)NC(=O)[C@@H](C)NC(=O)[C@@H](N)Cc1ccc(O)cc1)C(C)C)C(=O)NCC(O)=O
: