Target
Egl nine homolog 1
Ligand
BDBM50275001
Substrate
Meas. Tech.
ChEMBL_1714395 (CHEMBL4124444)
IC50
854±n/a nM
Citation
 Wu, YJiang, ZLi, ZGu, JYou, QZhang, X Click Chemistry-Based Discovery of [3-Hydroxy-5-(1 H-1,2,3-triazol-4-yl)picolinoyl]glycines as Orally Active Hypoxia-Inducing Factor Prolyl Hydroxylase Inhibitors with Favorable Safety Profiles for the Treatment of Anemia. J Med Chem 61:5332-5349 (2018)  
Target
Name:
Egl nine homolog 1
Synonyms:
C1orf12 EGLN1_HUMAN Hypoxia-inducible factor prolyl hydroxylase 2 (HIF-PH2) Prolyl hydroxylase domain-containing protein 2 (PHD2)
Type:
Protein
Mol. Mass.:
46035.59
Organism:
Homo sapiens (Human)
Description:
Q9GZT9
Residue:
426
  
Inhibitor
Name:
BDBM50275001
Synonyms:
CHEMBL4129131
Type:
Small organic molecule
Emp. Form.:
C21H17N5O3
Mol. Mass.:
387.3914
SMILES:
OC(=O)CNC(=O)c1ccc2cc(ccc2n1)-c1cn(Cc2ccccc2)nn1
: