Target
Cholinesterase
Ligand
BDBM50275269
Substrate
Meas. Tech.
ChEMBL_1714534 (CHEMBL4124583)
IC50
1800±n/a nM
Citation
 Mostofi, MMohammadi Ziarani, GLashgari, N Design, synthesis and biological evaluation of benzofuran appended benzothiazepine derivatives as inhibitors of butyrylcholinesterase and antimicrobial agents. Bioorg Med Chem 26:3076-3095 (2018)  
Target
Name:
Cholinesterase
Synonyms:
BCHE CHLE_HORSE | Cholinesterase
Type:
Enzyme
Mol. Mass.:
65643.35
Organism:
Equus caballus (Horse)
Description:
P81908
Residue:
574
  
Inhibitor
Name:
BDBM50275269
Synonyms:
CHEMBL4129504
Type:
Small organic molecule
Emp. Form.:
C24H18BrNO2S
Mol. Mass.:
464.374
SMILES:
COc1ccccc1C1CC(=Nc2ccccc2S1)c1cc2cc(Br)ccc2o1
: