Target
Sigma intracellular receptor 2
Ligand
BDBM321267
Substrate
Meas. Tech.
ChEBML_1716892
Ki
190±n/a nM
Citation
 Donnier-Maréchal, MCarato, PLarchanché, PERavez, SBoulahjar, RBarczyk, AOxombre, BVermersch, PMelnyk, P Synthesis and pharmacological evaluation of benzamide derivatives as potent and selective sigma-1 protein ligands. Eur J Med Chem 138:964-978 (2017)  
Target
Name:
Sigma intracellular receptor 2
Synonyms:
MAC30 S2R Sigma-2 receptor TMEM97 | Transmembrane protein 97
Type:
Protein
Mol. Mass.:
20857.20
Organism:
Homo sapiens (Human)
Description:
Q5BJF2
Residue:
176
  
Inhibitor
Name:
BDBM321267
Synonyms:
N-[3-(benzylmethylamino)propyl]-4-chlorobenzamide | US10179761, Compound 3.1.10
Type:
Small organic molecule
Emp. Form.:
C18H21ClN2O
Mol. Mass.:
316.825
SMILES:
CN(CCCNC(=O)c1ccc(Cl)cc1)Cc1ccccc1
: