Target
Polyunsaturated fatty acid 5-lipoxygenase
Ligand
BDBM50015129
Substrate
Meas. Tech.
ChEMBL_4285 (CHEMBL618396)
IC50
300±n/a nM
Citation
 Summers, JBKim, KHMazdiyasni, HHolms, JHRatajczyk, JDStewart, AODyer, RDCarter, GW Hydroxamic acid inhibitors of 5-lipoxygenase: quantitative structure-activity relationships. J Med Chem 33:992-8 (1990)  
Target
Name:
Polyunsaturated fatty acid 5-lipoxygenase
Synonyms:
Alox5 LOX5_RAT
Type:
PROTEIN
Mol. Mass.:
78082.31
Organism:
Rattus norvegicus
Description:
ChEMBL_1432947
Residue:
673
  
Inhibitor
Name:
BDBM50015129
Synonyms:
CHEMBL368826 | N-Hydroxy-N-methyl-3-(3-nitro-naphthalen-2-yl)-acrylamide
Type:
Small organic molecule
Emp. Form.:
C14H12N2O4
Mol. Mass.:
272.2561
SMILES:
CN(O)C(=O)\C=C\c1cc2ccccc2cc1[N+]([O-])=O
: