Target
Polyunsaturated fatty acid 5-lipoxygenase
Ligand
BDBM50015107
Substrate
Meas. Tech.
ChEMBL_4285 (CHEMBL618396)
IC50
380±n/a nM
Citation
 Summers, JBKim, KHMazdiyasni, HHolms, JHRatajczyk, JDStewart, AODyer, RDCarter, GW Hydroxamic acid inhibitors of 5-lipoxygenase: quantitative structure-activity relationships. J Med Chem 33:992-8 (1990)  
Target
Name:
Polyunsaturated fatty acid 5-lipoxygenase
Synonyms:
Alox5 LOX5_RAT
Type:
PROTEIN
Mol. Mass.:
78082.31
Organism:
Rattus norvegicus
Description:
ChEMBL_1432947
Residue:
673
  
Inhibitor
Name:
BDBM50015107
Synonyms:
CHEMBL68235 | N-Hydroxy-2-(4-isobutyl-phenyl)-N-phenyl-propionamide
Type:
Small organic molecule
Emp. Form.:
C19H23NO2
Mol. Mass.:
297.3914
SMILES:
CC(C)Cc1ccc(cc1)C(C)C(=O)N(O)c1ccccc1
: