Target
Serine/threonine-protein kinase PknB
Ligand
BDBM50279743
Substrate
Meas. Tech.
ChEMBL_1721605 (CHEMBL4136605)
Ki
4.0±n/a nM
Citation
 Wang, TBemis, GHanzelka, BZuccola, HWynn, MMoody, CSGreen, JLocher, CLiu, AGao, HXu, YWang, SWang, JBennani, YLThomson, JAMüh, U Mtb PKNA/PKNB Dual Inhibition Provides Selectivity Advantages for Inhibitor Design To Minimize Host Kinase Interactions. ACS Med Chem Lett 8:1224-1229 (2017)  
Target
Name:
Serine/threonine-protein kinase PknB
Synonyms:
PKNB_MYCTU | pknB
Type:
PROTEIN
Mol. Mass.:
66497.93
Organism:
Mycobacterium tuberculosis
Description:
ChEMBL_774233
Residue:
626
  
Inhibitor
Name:
BDBM50279743
Synonyms:
CHEMBL4170479
Type:
Small organic molecule
Emp. Form.:
C14H14N6O2S2
Mol. Mass.:
362.43
SMILES:
NS(=O)(=O)c1ccc(s1)-c1nccc(Nc2cc([nH]n2)C2CC2)n1
: