Target
Serine/threonine-protein kinase PknA
Ligand
BDBM50279743
Substrate
Meas. Tech.
ChEMBL_1721604 (CHEMBL4136604)
Ki
18±n/a nM
Citation
 Wang, TBemis, GHanzelka, BZuccola, HWynn, MMoody, CSGreen, JLocher, CLiu, AGao, HXu, YWang, SWang, JBennani, YLThomson, JAMüh, U Mtb PKNA/PKNB Dual Inhibition Provides Selectivity Advantages for Inhibitor Design To Minimize Host Kinase Interactions. ACS Med Chem Lett 8:1224-1229 (2017)  
Target
Name:
Serine/threonine-protein kinase PknA
Synonyms:
2.7.11.1 Serine/threonine-protein kinase PknA | pknA
Type:
PROTEIN
Mol. Mass.:
45619.67
Organism:
Mycobacterium tuberculosis (strain ATCC 25618 / H37Rv)
Description:
ChEMBL_117830
Residue:
431
  
Inhibitor
Name:
BDBM50279743
Synonyms:
CHEMBL4170479
Type:
Small organic molecule
Emp. Form.:
C14H14N6O2S2
Mol. Mass.:
362.43
SMILES:
NS(=O)(=O)c1ccc(s1)-c1nccc(Nc2cc([nH]n2)C2CC2)n1
: