Target
Lysine-specific histone demethylase 1A
Ligand
BDBM50279572
Substrate
Meas. Tech.
ChEMBL_1721251 (CHEMBL4136251)
IC50
3.0±n/a nM
Citation
 Abdel-Magid, AF Lysine-Specific Demethylase 1 (LSD1) Inhibitors as Potential Treatment for Different Types of Cancers. ACS Med Chem Lett 8:1134-1135 (2017)  
Target
Name:
Lysine-specific histone demethylase 1A
Synonyms:
AOF2 Flavin-containing amine oxidase domain-containing protein 2 KDM1A KIAA0601 Lysine-specific demethylase 1 (LSD1) Lysine-specific histone demethylase 1 (LSD1)
Type:
Enzyme
Mol. Mass.:
92901.01
Organism:
Homo sapiens (Human)
Description:
O60341
Residue:
852
  
Inhibitor
Name:
BDBM50279572
Synonyms:
CHEMBL4166623
Type:
Small organic molecule
Emp. Form.:
C22H23N3O
Mol. Mass.:
345.4375
SMILES:
Cc1cc2n(cc(-c3cccc(N)c3C)c2cc1C#N)[C@@H]1CC[C@@H](O)C1
: