Target
Carbonic anhydrase 9
Ligand
BDBM50279705
Substrate
Meas. Tech.
ChEMBL_1721603 (CHEMBL4136603)
Ki
2.7±n/a nM
Citation
 Angeli, ATanini, DCapperucci, ASupuran, CT Synthesis of Novel Selenides Bearing Benzenesulfonamide Moieties as Carbonic Anhydrase I, II, IV, VII, and IX Inhibitors. ACS Med Chem Lett 8:1213-1217 (2017)  
Target
Name:
Carbonic anhydrase 9
Synonyms:
CA-IX CAH9_HUMAN Carbonic anhydrase 9 (CA IX) Carbonic anhydrase 9 precursor Carbonic anhydrase IX (CAIX) Carbonic anhydrases; II & IX MN RCC-associated antigen G250
Type:
Enzyme
Mol. Mass.:
49669.03
Organism:
Homo sapiens (Human)
Description:
Catalytic domain of human cloned isozyme was used in the assay
Residue:
459
  
Inhibitor
Name:
BDBM50279705
Synonyms:
CHEMBL4161289
Type:
Small organic molecule
Emp. Form.:
C12H12N2O4S2Se2
Mol. Mass.:
470.28
SMILES:
[#7]S(=O)(=O)c1ccc([Se;v2][Se;v2]c2ccc(cc2)S([#7])(=O)=O)cc1
: